{"text_format":"1","workbook":"xlsx","n_sheets":8,"sheets":["Navodila","Podatki o računu","Račun HR","Račun","Kupci","Izdajatelji","Artikli","Šifranti"],"not_rendered":{"charts":0,"images":3,"macros":1,"external_links":0,"defined_names":5,"comments":0,"pivot_tables":0},"unopened":[],"bounds":{"document_bytes":16777216,"sheet_cells":100000,"rows_first":2000,"rows_last":500,"rows_between":2000,"halvings":0,"cell_chars":16384,"cell_head_chars":4096},"cells_cut":0,"cells_raw":0,"read":"whole","date_system":"1900"}

{"sheet":"Navodila","index":0,"n_rows":78,"n_cols":3,"rows_kept":78,"cut":false,"hidden":false,"merged":[]}
[]
[]
[]
[null,null,"Excel eRačun"]
[]
[]
[null,null,"Enostavna rešitev za pripravo eRačunov po standardu e-SLOG skupaj s pripadajočo vizualizacijo."]
[]
[null,null,"ZZI je na predlog uporabnikov razvil brezplačen pripomoček za pripravo in izdajo e-SLOG računa v programu Microsoft Excel. Pripomoček omogoča enostaven vnos podatkov računa, partnerjev, artiklov ter avtomatsko izdelavo e-SLOG računa s PDF vizualizacijo."]
[]
[null,null,"Ko je eRačun izdelan, ga morate še digitalno podpisati in poslati prejemniku, saj se ta dva koraka v trenutni verziji pripomočka bizBox Excel eRačun ne izvedeta samodejno. Za to uporabite storitev bizBox eIzmenjava. Vse kar potrebujete je aktiven bizBox račun ali namestitev brezplačnega ZZInet odjemalca, ki poskrbita, da bodo vaši izdani računi varno in zanesljivo prišli do prejemnika, stroški pošiljanja pa so nižji od stroška klasične pošte."]
[]
[null,null,"Neodvisno od uporabe storitve eIzmenjava vam priporočamo, da se registrirate na spletnem portalu www.bizbox.eu, ki vam omogoča brezplačen pregled prejetih dokumentov v eNabiralniku."]
[]
[null,null,"Po ZDDV-1 je potrebno eRačune hraniti najmanj 10 let v izvorni (elektronski) obliki. V ta namen lahko najamete zakonsko skladno in certificirano storitev eHramba.si."]
{"$rows_left_out":64}
{"sheet":"Podatki o računu","index":1,"n_rows":50,"n_cols":24,"rows_kept":50,"cut":false,"hidden":false,"merged":[[3,5,4,8],[3,1,4,1],[3,2,4,2],[22,6,22,8],[14,6,14,8],[15,6,15,8],[16,6,16,8],[17,6,17,8],[18,6,18,8],[6,6,6,8],[7,6,7,8],[10,6,10,8],[11,6,11,8],[13,6,13,8],[8,6,8,8],[9,6,9,8],[24,16,25,16],[33,1,34,1],[33,2,34,2],[24,4,25,4],[24,5,25,5],[24,6,25,6],[24,7,25,7],[24,8,25,8],[24,9,25,9],[24,10,25,10],[24,11,25,11],[24,12,25,12],[24,13,25,13],[24,14,25,14],[24,15,25,15],[19,1,20,1],[19,2,20,2],[19,6,19,8],[20,6,20,8],[21,6,21,8]]}
[]
[null,"bizBox Excel eRačun za eSLOG 2.0",null,null,null,null,null,null,null,null,null,null,null,null,null,null,null,null,null,null,"prikaz iz šifranta"]
[null,null,null,null,null,null,null,null,null,null,null,null,null,null,null,null,null,null,null,null,"izdajatelj",{"$f":"MATCH(C4,Izdajatelji!C3:E3,0)","v":1}]
[null,"Izdajatelj","Podjetje 1",null,null,"Podatki o računu",null,null,null,null,null,null,null,null,null,null,null,null,null,null,"plačnik",{"$f":"MATCH(C20,Kupci!P3:P1000,0)","v":1}]
[null,null,null,null,null,null,null,null,null,null,null,null,null,null,null,null,null,null,null,null,"prejemnik",{"$f":"MATCH(C34,Kupci!P3:P1000,0)","v":1}]
[null,"Naziv podjetja",{"$f":"IF(INDEX(Izdajatelji!$C$3:$E$18,ROW(B2),$V$3)=0,\"\",INDEX(Izdajatelji!$C$3:$E$18,ROW(B2),$V$3))","v":"BIROKRAT d.o.o."},null,null,"Vrsta računa","Račun","Poslovni proces","P1"]
[null,"Naslov podjetja",{"$f":"IF(INDEX(Izdajatelji!$C$3:$E$18,ROW(B3),$V$3)=0,\"\",INDEX(Izdajatelji!$C$3:$E$18,ROW(B3),$V$3))","v":"Dunajska 191"},null,null,"Številka računa","2021-9512"]
[null,"Poštna številka",{"$f":"IF(INDEX(Izdajatelji!$C$3:$E$18,ROW(B4),$V$3)=0,\"\",INDEX(Izdajatelji!$C$3:$E$18,ROW(B4),$V$3))","v":1000},null,null,"Sklic (referenca)",9512]
[null,"Mesto",{"$f":"IF(INDEX(Izdajatelji!$C$3:$E$18,ROW(B5),$V$3)=0,\"\",INDEX(Izdajatelji!$C$3:$E$18,ROW(B5),$V$3))","v":"Ljubljana"},null,null,"Valuta računa","EUR",null,null,null,null,null,null,null,null,"www.bizbox.eu "]
[null,"Država",{"$f":"IF(INDEX(Izdajatelji!$C$3:$E$18,ROW(B6),$V$3)=0,\"\",INDEX(Izdajatelji!$C$3:$E$18,ROW(B6),$V$3))","v":"SI"},null,null,"Datum izdaje računa","2021-04-19",null,null,null,null,"Avtor ZZI d.o.o.",null,null,null,"www.zzi.si "]
[null,"Kontaktna oseba",{"$f":"IF(INDEX(Izdajatelji!$C$3:$E$18,ROW(B7),$V$3)=0,\"\",INDEX(Izdajatelji!$C$3:$E$18,ROW(B7),$V$3))","v":"Bojan Mirčeta"},null,null,"Datum zapadlosti","2021-04-30"]
[null,"E-pošta",{"$f":"IF(INDEX(Izdajatelji!$C$3:$E$18,ROW(B8),$V$3)=0,\"\",INDEX(Izdajatelji!$C$3:$E$18,ROW(B8),$V$3))","v":"bojanm@andersen.si"},null,null,"Datum opravljene storitve / dobave blaga","2021-03-31"]
[null,"Telefon",{"$f":"IF(INDEX(Izdajatelji!$C$3:$E$18,ROW(B9),$V$3)=0,\"\",INDEX(Izdajatelji!$C$3:$E$18,ROW(B9),$V$3))","v":"030 611 000"},null,null,"Obdobje storitve OD",null,"DO",null,null,"bizBox Excel eRačun je brezplačen pripomoček za izdelavo eRačuna v formatu e-Slog 2.0 s pripadajočo "]
[null,"Matična številka",{"$f":"IF(INDEX(Izdajatelji!$C$3:$E$18,ROW(B10),$V$3)=0,\"\",INDEX(Izdajatelji!$C$3:$E$18,ROW(B10),$V$3))","v":"3539482000"},null,null,"Referenčni dokument","Naročilo",null,null,null,"vizualizacijo."]
[null,"Davčna številka",{"$f":"IF(INDEX(Izdajatelji!$C$3:$E$18,ROW(B11),$V$3)=0,\"\",INDEX(Izdajatelji!$C$3:$E$18,ROW(B11),$V$3))","v":"24893099"},null,null,"Številka referenčnega dokumenta","1",null,null,null,"Podrobna navodila za uporabo pripomočka najdete na listu Navodila."]
{"$rows_left_out":36}
{"sheet":"Račun HR","index":2,"n_rows":56,"n_cols":15,"rows_kept":56,"cut":false,"hidden":false,"merged":[[54,1,54,12],[41,11,41,12],[42,11,42,12],[43,11,43,12],[44,11,44,12],[50,1,51,12],[52,1,53,12],[40,11,40,12],[28,1,28,3],[29,1,29,3],[30,1,30,3],[31,1,31,3],[32,1,32,3],[33,1,33,3],[34,1,34,3],[35,1,35,3],[36,1,36,3],[37,1,37,3],[39,11,39,12],[27,1,27,3],[15,1,15,12],[17,1,17,3],[18,1,18,3],[19,1,19,3],[20,1,20,3],[21,1,21,3],[22,1,22,3],[23,1,23,3],[24,1,24,3],[25,1,25,3],[26,1,26,3]]}
[null,{"$f":"'Podatki o računu'!C6&\", \"&'Podatki o računu'!C7&\", \"&'Podatki o računu'!C8&\" \"&'Podatki o računu'!C9&\", \"&'Podatki o računu'!C10","v":"BIROKRAT d.o.o., Dunajska 191, 1000 Ljubljana, SI"}]
[null,{"$f":"IF('Podatki o računu'!C11<>\"\",\"\"&'Podatki o računu'!C11&\", E: \"&'Podatki o računu'!C12&\", T: \"&'Podatki o računu'!C13,\"\"&\"E: \"&'Podatki o računu'!C12&\", T: \"&'Podatki o računu'!C13)","v":"Bojan Mirčeta, E: bojanm@andersen.si, T: 030 611 000"}]
[null,{"$f":"IF('Podatki o računu'!C16=\"DA\",\"PDV ID: \"&'Podatki o računu'!C10&'Podatki o računu'!C15,\"Porezni broj: \"&'Podatki o računu'!C15)","v":"PDV ID: SI24893099"}]
[null,{"$f":"\"IBAN: \"&'Podatki o računu'!C17&\", BIC: \"&'Podatki o računu'!C18","v":"IBAN: SI56 1010 0005 7117 281, BIC: LJBASI2X"}]
[]
[null,"KUPAC",null,null,null,"PRIMATELJ",null,null,null,{"$f":"'Podatki o računu'!G6&\" br. \"&'Podatki o računu'!G7","v":"Račun br. 2021-9512"}]
[null,{"$f":"'Podatki o računu'!C22","v":"BIROKRAT IT d.o.o."},null,null,null,{"$f":"'Podatki o računu'!C36","v":"BIROKRAT IT d.o.o."},null,null,null,"Datum izdavanja",null,null,{"$f":"TEXT('Podatki o računu'!G10,\"dd. mm. yyyy\")","v":"19. 04. 2021"}]
[null,{"$f":"'Podatki o računu'!C23","v":"Boštjan Juvančič"},null,null,null,{"$f":"'Podatki o računu'!C37","v":"Boštjan Juvančič"},null,null,null,"Datum usluge/isporuke robe",null,null,{"$f":"IF('Podatki o računu'!G12=\"\",\"-\",\"\"&TEXT('Podatki o računu'!G12,\"dd.mm.yyyy\"))","v":"31.03.2021"}]
[null,{"$f":"'Podatki o računu'!C24","v":"Dunajska 191"},null,null,null,{"$f":"'Podatki o računu'!C38","v":"Dunajska 191"},null,null,null,"Razdoblje usluge",null,null,{"$f":"IF(OR('Podatki o računu'!G13=\"\",'Podatki o računu'!I13=\"\"),\"-\",\"\"&TEXT('Podatki o računu'!G13,\"dd.mm.yyyy\")&\" do \"&TEXT('Podatki o računu'!I13,\"dd.mm.yyyy\"))","v":"-"}]
[null,{"$f":"'Podatki o računu'!C25&\" \"&'Podatki o računu'!C26","v":"1000 Ljubljana"},null,null,null,{"$f":"'Podatki o računu'!C39&\" \"&'Podatki o računu'!C40","v":"1000 Ljubljana"},null,null,null,"Datum dospijeća",null,null,{"$f":"TEXT('Podatki o računu'!G11,\"dd. mm. yyyy\")","v":"30. 04. 2021"}]
[null,{"$f":"'Podatki o računu'!C27","v":"SI"},null,null,null,{"$f":"'Podatki o računu'!C41","v":"SI"},null,null,null,"Referentni dokument",null,null,{"$f":"'Podatki o računu'!G14&\" \"&'Podatki o računu'!G15","v":"Naročilo 1"}]
[null,{"$f":"IF('Podatki o računu'!C30=\"DA\",\"PDV ID: \"&'Podatki o računu'!C27&'Podatki o računu'!C29,\"Porezni broj: \"&'Podatki o računu'!C29)","v":"PDV ID: SI84046597"},null,null,null,null,null,null,null,"Poziv na broj",null,null,{"$f":"IF('Podatki o računu'!G8=\"\",\"\",'Podatki o računu'!G8)","v":9512}]
[null,{"$f":"'Podatki o računu'!C31&IF(AND('Podatki o računu'!C31<>\"\",'Podatki o računu'!C32<>\"\"),\", \",\"\")&'Podatki o računu'!C32","v":"SI56 1010 0005 7229 122, BAKOSI2X"},null,null,null,null,null,null,null,"Šifra namjene",null,null,{"$f":"'Podatki o računu'!G17","v":"COST"}]
[null,null,null,null,null,null,null,null,null,"Troškovno mjesto",null,null,{"$f":"IF('Podatki o računu'!G20=\"\",\"\",'Podatki o računu'!G20)","v":""}]
[]
{"$rows_left_out":42}
{"sheet":"Račun","index":3,"n_rows":56,"n_cols":15,"rows_kept":56,"cut":false,"hidden":false,"merged":[[15,1,15,12],[17,1,17,3],[50,1,51,12],[52,1,53,12],[54,1,54,12],[18,1,18,3],[19,1,19,3],[20,1,20,3],[21,1,21,3],[22,1,22,3],[23,1,23,3],[24,1,24,3],[25,1,25,3],[26,1,26,3],[27,1,27,3],[28,1,28,3],[34,1,34,3],[35,1,35,3],[36,1,36,3],[37,1,37,3],[29,1,29,3],[30,1,30,3],[31,1,31,3],[32,1,32,3],[33,1,33,3],[39,11,39,12],[44,11,44,12],[43,11,43,12],[42,11,42,12],[41,11,41,12],[40,11,40,12]]}
[null,{"$f":"'Podatki o računu'!C6&\", \"&'Podatki o računu'!C7&\", \"&'Podatki o računu'!C8&\" \"&'Podatki o računu'!C9&\", \"&'Podatki o računu'!C10","v":"BIROKRAT d.o.o., Dunajska 191, 1000 Ljubljana, SI"}]
[null,{"$f":"IF('Podatki o računu'!C11<>\"\",\"\"&'Podatki o računu'!C11&\", E: \"&'Podatki o računu'!C12&\", T: \"&'Podatki o računu'!C13,\"\"&\"E: \"&'Podatki o računu'!C12&\", T: \"&'Podatki o računu'!C13)","v":"Bojan Mirčeta, E: bojanm@andersen.si, T: 030 611 000"}]
[null,{"$f":"IF('Podatki o računu'!C16=\"DA\",\"ID za DDV: \"&'Podatki o računu'!C10&'Podatki o računu'!C15,\"Davčna številka: \"&'Podatki o računu'!C15)","v":"ID za DDV: SI24893099"}]
[null,{"$f":"\"IBAN: \"&'Podatki o računu'!C17&\", BIC: \"&'Podatki o računu'!C18","v":"IBAN: SI56 1010 0005 7117 281, BIC: LJBASI2X"}]
[]
[null,"KUPEC",null,null,null,"PREJEMNIK BLAGA",null,null,null,{"$f":"'Podatki o računu'!G6&\" št. \"&'Podatki o računu'!G7","v":"Račun št. 2021-9512"}]
[null,{"$f":"'Podatki o računu'!C22","v":"BIROKRAT IT d.o.o."},null,null,null,{"$f":"'Podatki o računu'!C36","v":"BIROKRAT IT d.o.o."},null,null,null,"Datum izdaje računa",null,null,{"$f":"TEXT('Podatki o računu'!G10,\"dd. mm. yyyy\")","v":"19. 04. 2021"}]
[null,{"$f":"'Podatki o računu'!C23","v":"Boštjan Juvančič"},null,null,null,{"$f":"'Podatki o računu'!C37","v":"Boštjan Juvančič"},null,null,null,"Datum storitve/dobave blaga",null,null,{"$f":"IF('Podatki o računu'!G12=\"\",\"-\",\"\"&TEXT('Podatki o računu'!G12,\"dd.mm.yyyy\"))","v":"31.03.2021"}]
[null,{"$f":"'Podatki o računu'!C24","v":"Dunajska 191"},null,null,null,{"$f":"'Podatki o računu'!C38","v":"Dunajska 191"},null,null,null,"Obdobje storitve",null,null,{"$f":"IF(OR('Podatki o računu'!G13=\"\",'Podatki o računu'!I13=\"\"),\"-\",\"\"&TEXT('Podatki o računu'!G13,\"dd.mm.yyyy\")&\" do \"&TEXT('Podatki o računu'!I13,\"dd.mm.yyyy\"))","v":"-"}]
[null,{"$f":"'Podatki o računu'!C25&\" \"&'Podatki o računu'!C26","v":"1000 Ljubljana"},null,null,null,{"$f":"'Podatki o računu'!C39&\" \"&'Podatki o računu'!C40","v":"1000 Ljubljana"},null,null,null,"Datum zapadlosti",null,null,{"$f":"TEXT('Podatki o računu'!G11,\"dd. mm. yyyy\")","v":"30. 04. 2021"}]
[null,{"$f":"'Podatki o računu'!C27","v":"SI"},null,null,null,{"$f":"'Podatki o računu'!C41","v":"SI"},null,null,null,"Referenčni dokument",null,null,{"$f":"'Podatki o računu'!G14&\" \"&'Podatki o računu'!G15","v":"Naročilo 1"}]
[null,{"$f":"IF('Podatki o računu'!C30=\"DA\",\"ID za DDV: \"&'Podatki o računu'!C27&'Podatki o računu'!C29,\"Davčna številka: \"&'Podatki o računu'!C29)","v":"ID za DDV: SI84046597"},null,null,null,null,null,null,null,"Sklic nakazila",null,null,{"$f":"IF('Podatki o računu'!G8=\"\",\"\",'Podatki o računu'!G8)","v":9512}]
[null,{"$f":"'Podatki o računu'!C31&IF(AND('Podatki o računu'!C31<>\"\",'Podatki o računu'!C32<>\"\"),\", \",\"\")&'Podatki o računu'!C32","v":"SI56 1010 0005 7229 122, BAKOSI2X"},null,null,null,null,null,null,null,"Koda namena",null,null,{"$f":"'Podatki o računu'!G17","v":"COST"}]
[null,null,null,null,null,null,null,null,null,"Stroškovno mesto",null,null,{"$f":"IF('Podatki o računu'!G20=\"\",\"\",'Podatki o računu'!G20)","v":""}]
[]
{"$rows_left_out":42}
{"sheet":"Kupci","index":4,"n_rows":1003,"n_cols":16,"rows_kept":1003,"cut":false,"hidden":false,"merged":[]}
[null,"KUPCI",null,null,null,null,null,null,null,null,null,null,"bizBox Excel eRačun"]
[null,"ID","Naziv","Kontaktna oseba","Naslov","Poštna\nštevilka","Mesto","Država","Matična\nštevilka","Davčna\nštevilka","Zavezanec\nza DDV","IBAN","BIC","Šifra\nlokacije",null,"TEMP"]
[null,1,"BIROKRAT IT d.o.o.","Boštjan Juvančič","Dunajska 191",1000,"Ljubljana","SI",6538886000,"84046597","DA","SI56 1010 0005 7229 122","BAKOSI2X","1001",null,{"$f":"B3&IF(AND(C3=\"\",D3=\"\",E3=\"\"),\"\",\" - \")&C3&IF(OR(D3=\"\",C3=\"\"),\"\",\" - \")&D3","v":"1 - BIROKRAT IT d.o.o. - Boštjan Juvančič"}]
[null,null,null,null,null,null,null,null,null,null,null,null,null,null,null,{"$f":"B4&IF(AND(C4=\"\",D4=\"\",E4=\"\"),\"\",\" - \")&C4&IF(OR(D4=\"\",C4=\"\"),\"\",\" - \")&D4","v":""}]
[null,null,null,null,null,null,null,null,null,null,null,null,null,null,null,""]
[null,null,null,null,null,null,null,null,null,null,null,null,null,null,null,{"$f":"B6&IF(AND(C6=\"\",D6=\"\",E6=\"\"),\"\",\" - \")&C6&IF(OR(D6=\"\",C6=\"\"),\"\",\" - \")&D6","v":""}]
[null,null,null,null,null,null,null,null,null,null,null,null,null,null,null,""]
[null,null,null,null,null,null,null,null,null,null,null,null,null,null,null,""]
[null,null,null,null,null,null,null,null,null,null,null,null,null,null,null,""]
[null,null,null,null,null,null,null,null,null,null,null,null,null,null,null,""]
[null,null,null,null,null,null,null,null,null,null,null,null,null,null,null,""]
[null,null,null,null,null,null,null,null,null,null,null,null,null,null,null,""]
[null,null,null,null,null,null,null,null,null,null,null,null,null,null,null,""]
[null,null,null,null,null,null,null,null,null,null,null,null,null,null,null,""]
[null,null,null,null,null,null,null,null,null,null,null,null,null,null,null,""]
{"$rows_left_out":989}
{"sheet":"Izdajatelji","index":5,"n_rows":17,"n_cols":5,"rows_kept":17,"cut":false,"hidden":false,"merged":[]}
[]
[null,"IZDAJATELJI RAČUNA",null,null,"bizBox Excel eRačun"]
[null,"Podatek","Podjetje 1","Podjetje 2","Podjetje 3"]
[null,"Naziv","BIROKRAT d.o.o."]
[null,"Naslov","Dunajska 191"]
[null,"Poštna številka",1000]
[null,"Mesto","Ljubljana"]
[null,"Država","SI"]
[null,"Kontaktna oseba","Bojan Mirčeta"]
[null,"E-pošta","bojanm@andersen.si"]
[null,"Telefon","030 611 000"]
[null,"Matična številka","3539482000"]
[null,"Davčna številka","24893099"]
[null,"Zavezanec za DDV","DA"]
[null,"IBAN","SI56 1010 0005 7117 281"]
{"$rows_left_out":3}
{"sheet":"Artikli","index":6,"n_rows":1005,"n_cols":8,"rows_kept":1005,"cut":false,"hidden":false,"merged":[]}
[]
[null,"ARTIKLI",null,null,null,"bizBox Excel eRačun"]
[null,"ID","Naziv","Šifra","Enota","Cena",null,"temp"]
[null,1,"Predplačana podpora tehnika/svetovalca preko navadne telefonske linije oz. Povezave",112901811265,"ura",58,null,{"$f":"B4","v":1}]
[null,2,"Posodobitve in vzdrževanje programa Birokrat","IB1N","mesec",69,null,{"$f":"B5","v":2}]
[null,3,"Birokrat SINHRO","SINHRO100000","mesec",5,null,3]
[null,4,"Četrti izdelek","abc-0004","m3",15000,null,4]
[null,5,"Peti izdelek",null,"KW/h",5.0000000000000001E-3,null,5]
[null,6,"Šesti izdelek","abc-0006","Kg",12.811999999999999,null,6]
[null,null,null,null,null,null,null,0]
[null,null,null,null,null,null,null,0]
[null,null,null,null,null,null,null,0]
[null,null,null,null,null,null,null,0]
[null,null,null,null,null,null,null,0]
[null,null,null,null,null,null,null,0]
{"$rows_left_out":991}
{"sheet":"Šifranti","index":7,"n_rows":438,"n_cols":38,"rows_kept":438,"cut":false,"hidden":true,"merged":[]}
[null,"NAČIN PLAČILA",null,null,null,"DATUMI",null,null,null,"REFERENČNI DOKUMENT",null,"DDV",null,null,"FUNKCIJA RAČUNA ",null,null,"VRSTA DOKUMENTA",null,null,"KODA NAMENA",null,null,"DRŽAVE",null,null,"POPUST / PRIBITEK",null,"DDV PO DRŽAVAH",null,null,null,"DDV za izbrano državo",null,null,"ZAVEZANEC ZA DDV",null,"POSLOVNI PROCESI"]
[null,"Opis","Koda",null,null,"Opis","Vrednost",null,null,"Opis",null,"Opis kode","Koda",null,"Opis kode","Koda",null,"Opis kode","Koda",null,"Opis kode","Koda",null,"Opis kode","Koda",null,"Opis",null,"Država","Opis kode","Koda",null,"Opis kode","Koda",null,"Opis",null,"Opis"]
[null,"Račun je potrebno plačati",0,null,null,"Današnji dan",{"$f":"TODAY()","v":"2021-04-23"},null,null,"Dobavnica",null,22,22,null,"ORIGINAL",null,null,"Račun",380,null,"Upravljanje denarnih sredstev - znotraj banke","ACCT",null,"Slovenia","SI",null,"Popust",null,"SI",22,22,null,{"$f":"IFERROR(INDEX($AD$3:AD25, SMALL(IF('Podatki o računu'!$C$10=$AC$3:AC25, ROW(Šifranti!$AD$3:AD25)-2,\"\"), ROW()-2)),\"\")","v":22},{"$f":"IFERROR(INDEX($AE$3:AE25, SMALL(IF('Podatki o računu'!$C$10=$AC$3:AC25, ROW(Šifranti!$AE$3:AE25)-2,\"\"), ROW()-2)),\"\")","v":22},null,"DA",null,"P1"]
[null,"Račun bo plačan preko direktne obremenitve in ga ni potrebno plačati",1,null,null,"Začetek datumskega obdobja","1970-01-01",null,null,"Naročilo",null,9.5,9.5,null,"KOPIJA",null,null,"Dobropis",381,null,"Plačilo vnaprej/predplačilo","ADVA",null,"Croatia","HR",null,"Pribitek",null,"SI",9.5,9.5,null,{"$f":"IFERROR(INDEX($AD$3:AD26, SMALL(IF('Podatki o računu'!$C$10=$AC$3:AC26, ROW(Šifranti!$AD$3:AD26)-2,\"\"), ROW()-2)),\"\")","v":9.5},{"$f":"IFERROR(INDEX($AE$3:AE26, SMALL(IF('Podatki o računu'!$C$10=$AC$3:AC26, ROW(Šifranti!$AE$3:AE26)-2,\"\"), ROW()-2)),\"\")","v":9.5},null,"NE",null,"P2"]
[null,"Račun je bil že plačan",2,null,null,null,null,null,null,"Pogodba",null,0,0,null,null,null,null,"Predračun",325,null,"Administrativne storitve","ADMG",null,"Czechia","CZ",null,null,null,"SI",0,0,null,{"$f":"IFERROR(INDEX($AD$3:AD27, SMALL(IF('Podatki o računu'!$C$10=$AC$3:AC27, ROW(Šifranti!$AD$3:AD27)-2,\"\"), ROW()-2)),\"\")","v":0},{"$f":"IFERROR(INDEX($AE$3:AE27, SMALL(IF('Podatki o računu'!$C$10=$AC$3:AC27, ROW(Šifranti!$AE$3:AE27)-2,\"\"), ROW()-2)),\"\")","v":0},null,null,null,"P3"]
[null,"Drugo - ni možnosti plačila",3,null,null,null,null,null,null,"Prodajni nalog",null,"22 (76.a člen)",0,null,null,null,null,"Avansni račun",386,null,"Aktivna politika zaposlovanja","AEMP",null,"Montenegro","ME",null,null,null,"SI","22 (76.a člen)",0,null,{"$f":"IFERROR(INDEX($AD$3:AD28, SMALL(IF('Podatki o računu'!$C$10=$AC$3:AC28, ROW(Šifranti!$AD$3:AD28)-2,\"\"), ROW()-2)),\"\")","v":"22 (76.a člen)"},{"$f":"IFERROR(INDEX($AE$3:AE28, SMALL(IF('Podatki o računu'!$C$10=$AC$3:AC28, ROW(Šifranti!$AE$3:AE28)-2,\"\"), ROW()-2)),\"\")","v":0},null,null,null,"P4"]
[null,null,null,null,null,null,null,null,null,"Prevzemnica",null,"9,5 (76.a člen)",0,null,null,null,null,null,null,null,"Plačilo v kmetijstvu","AGRT",null,"Austria","AT",null,null,null,"SI","9,5 (76.a člen)",0,null,{"$f":"IFERROR(INDEX($AD$3:AD26, SMALL(IF('Podatki o računu'!$C$10=$AC$3:AC26, ROW(Šifranti!$AD$3:AD26)-2,\"\"), ROW()-2)),\"\")","v":"9,5 (76.a člen)"},{"$f":"IFERROR(INDEX($AE$3:AE26, SMALL(IF('Podatki o računu'!$C$10=$AC$3:AC26, ROW(Šifranti!$AE$3:AE26)-2,\"\"), ROW()-2)),\"\")","v":0},null,null,null,"P5"]
[null,null,null,null,null,null,null,null,null,"Projekt",null,null,null,null,null,null,null,null,null,null,"Zračni prevoz","AIRB",null,"United Kingdom of Great Britain and Northern Ireland (the)","GB",null,null,null,"HR",25,25,null,{"$f":"IFERROR(INDEX($AD$3:AD27, SMALL(IF('Podatki o računu'!$C$10=$AC$3:AC27, ROW(Šifranti!$AD$3:AD27)-2,\"\"), ROW()-2)),\"\")","v":""},null,null,null,null,"P6"]
[null,null,null,null,null,null,null,null,null,"Eksterni objekt",null,null,null,null,null,null,null,null,null,null,"Preživnina","ALMY",null,"Albania","AL",null,null,null,"HR",13,13,null,null,null,null,null,null,"P7"]
[null,null,null,null,null,null,null,null,null,null,null,null,null,null,null,null,null,null,null,null,"Plačilo obroka kredita/zavarovanja","ANNI",null,"Algeria","DZ",null,null,null,"HR",5,5,null,null,null,null,null,null,"P8"]
[null,null,null,null,null,null,null,null,null,null,null,null,null,null,null,null,null,null,null,null,"Storitve anestezije","ANTS",null,"American Samoa","AS",null,null,null,"HR",0,0,null,null,null,null,null,null,"P9"]
[null,null,null,null,null,null,null,null,null,null,null,null,null,null,null,null,null,null,null,null,"Vnos/vpis terjatev","AREN",null,"Andorra","AD",null,null,null,"ME",21,21,null,null,null,null,null,null,"P10"]
[null,null,null,null,null,null,null,null,null,null,null,null,null,null,null,null,null,null,null,null,"Otroški dodatek","BECH",null,"Angola","AO",null,null,null,"ME",7,7,null,null,null,null,null,null,"P11"]
[null,null,null,null,null,null,null,null,null,null,null,null,null,null,null,null,null,null,null,null,"Podpora za brezposelne/invalide","BENE",null,"Anguilla","AI",null,null,null,"ME",0,0,null,null,null,null,null,null,"P12"]
[null,null,null,null,null,null,null,null,null,null,null,null,null,null,null,null,null,null,null,null,"Poslovni izdatki","BEXP",null,"Antarctica","AQ",null,null,null,"CZ",21,21]
{"$rows_left_out":423}